{"text_format":"1","workbook":"xlsx","n_sheets":12,"sheets":["FACTORES","TITULAR","CONYUGE","DEPENDIENTE","VALORES","CuadroEspecificacionesTARIFARIO","COTIZACION","IMPRESION","TARIFARIO","Instrucciones","Cotizador","CAMBIOS ME"],"not_rendered":{"charts":0,"images":7,"macros":1,"external_links":0,"defined_names":27,"comments":0,"pivot_tables":0},"unopened":[],"bounds":{"document_bytes":16777216,"sheet_cells":100000,"rows_first":2000,"rows_last":500,"rows_between":2000,"halvings":0,"cell_chars":16384,"cell_head_chars":4096},"cells_cut":0,"cells_raw":0,"read":"whole","date_system":"1900"}

{"sheet":"FACTORES","index":0,"n_rows":436,"n_cols":23,"rows_kept":436,"cut":false,"hidden":true,"merged":[[31,11,31,12],[31,8,31,9],[35,3,35,4],[0,2,0,3],[4,4,4,5],[8,4,8,5],[35,1,35,2],[0,0,0,1],[0,4,0,5],[6,2,6,3],[14,2,14,3]]}
["DEDUCIBLE",null,"COASEGURO",null,"EMERGENCIA EN EL EXTRANJERO",null,null,null,"DED CERO POR ACC","COSTO",null,null,"RPF","FIJO","CAPTURA","% CALCULO"]
["NUEVOS",null,0,1.1499999999999999,null,null,null,null,null,null,null,null,"SEMESTRAL",4.7300000000000002E-2,{"$f":"+COTIZACION!H36","v":4.7300000000000002E-2},{"$f":"IF(O2=0,1+N2,1+O2)","v":1.0472999999999999}]
[6000,1,0.05,1.0900000000000001,null,null,null,null,null,null,null,null,"TRIMESTRAL",7.0000000000000007E-2,{"$f":"+COTIZACION!H37","v":6.9900000000000004E-2},{"$f":"IF(O3=0,1+N3,1+O3)","v":1.0699000000000001}]
[8000,0.94,0.1,1,null,null,null,null,null,null,null,null,"MENSUAL",0.1,{"$f":"+COTIZACION!H38","v":9.9900000000000003E-2},{"$f":"IF(O4=0,1+N4,1+O4)","v":1.0999000000000001}]
[10000,0.88,0.15,0.98,"COBERTURA EN EL EXTRANJERO",null,null,null,5500,617.75994436717667,null,541.66999999999996,{"$f":"(J5/L5)-1","v":0.14047287899860939}]
[15000,0.75900000000000001,0.2,0.92,null,null,null,null,6000,655.21307371349099,null,574.51,{"$f":"(J6/L6)-1","v":0.14047287899860916}]
[20000,0.65400000000000003,"Catálogo",null,null,null,null,null,7000,686.84979137691244,null,602.25,0.14047287899860916]
[25000,0.56699999999999995,null,null,null,null,null,null,8000,714.26675938803908,null,626.29,0.14047287899860939]
[30000,0.52,null,null,"FORMA DE PAGO",null,null,null,9000,738.47899860917948,null,647.52,0.14047287899860939]
[40000,0.45700000000000002,null,null,"A = ANUAL",0,null,null,10000,760.10236439499317,null,666.48,0.14047287899860939]
[50000,0.40899999999999997,null,null,"S = SEMESTRAL",4.7300000000000002E-2,null,null,15000,843.36828929068156,null,739.49,0.14047287899860916]
[null,null,null,null,"T = TRIMESTRAL",7.0000000000000007E-2,null,null,20000,902.45618915159946,null,791.3,0.14047287899860916]
[null,null,null,null,"M = MENSUAL",0.1,null,null,25000,948.26898470097376,null,831.47,0.14047287899860939]
[null,null,null,null,null,null,null,null,30000,1510.8186369958278,null,1324.73,0.14047287899860939]
[null,null,"Topes de COASEGURO",null,null,null,null,null,35000,1559.3571627260087,null,1367.29,0.14047287899860939]
[null,null,0,"NA",null,null,null,null,40000,1601.3721835883175,null,1404.13,0.14047287899860939]
[null,null,0.05,"NA",null,null,null,null,45000,1638.4489568845622,null,1436.64,0.14047287899860939]
[null,null,0.1,"$30,000",null,null,null,null,50000,1671.5910987482616,null,1465.7,0.14047287899860916]
[null,null,0.15,"NA"]
[null,null,0.2,"NA"]
{"$rows_left_out":417}
{"sheet":"TITULAR","index":1,"n_rows":112,"n_cols":20,"rows_kept":112,"cut":false,"hidden":true,"merged":[[24,13,30,13],[228,22,228,23],[228,20,228,21],[151,19,151,26],[213,19,213,22],[156,19,156,26],[212,19,212,26],[25,1,25,2],[1,8,8,9],[24,5,24,6],[24,3,24,4],[23,9,23,10],[23,3,23,4],[23,5,23,6]]}
[null,"GASTOS MÉDICOS MAYORES INDIVIDUAL/FAMILIAR",null,null,null,null,null,null,"REGION COBERTURA BASICA",null,null,null,null,"Prima riesgo dental incremental",101,null,null,"Prima riesgo visión opcional",114.67]
[null,null,null,null,null,null,null,null,{"$f":"IF(ISERROR(VLOOKUP(E3,VALORES!$A$6:$B$11,2,FALSE)),\"REGION NO VALIDA\",VLOOKUP(E3,VALORES!$A$6:$B$11,2,FALSE))","v":"CHIHUAHUA, NUEVO LEON, TAMAULIPAS"},null,null,null,null,"Gastos",0.57455000000000001,null,null,"Gastos",0.51313999999999993]
[null,"REGIÓN:",null,null,{"$f":"+COTIZACION!D15","v":4},{"$f":"IF(E3>7,\"NO PROCEDE\",\" \")","v":" "},"FACTORES",null,null,null,null,null,null,null,{"$f":"+O1/(1-O2)","v":237.39569867199435},null,null,null,{"$f":"+S1/(1-S2)","v":235.529721069712}]
[]
[null,"SUMA ASEGURADA:",null,null,{"$f":"+COTIZACION!D11","v":10000000},null,{"$f":"VLOOKUP(E5,FACTORES!$I$33:$J$124,2)","v":1.26},null,null,null,null,null,null,"Asistencias",102.24]
[null,"DEDUCIBLE:",null,null,{"$f":"+COTIZACION!D12","v":10000},null,{"$f":"VLOOKUP(E6,FACTORES!$A$2:$B$29,2,0)","v":0.88},null,null,null,null,null,null,"Gastos",0.48549999999999999]
[null,"ELIMINACION DEDUCIBLE",null,null,{"$f":"+COTIZACION!D16","v":"SI"},null,{"$f":"IF(H7=\"SI\",VLOOKUP(E6,FACTORES!I5:J18,2,0),0)","v":760.10236439499317},{"$f":"+IF(COTIZACION!D12>50000,\"NO\",COTIZACION!D16)","v":"SI"},null,null,null,null,null,null,{"$f":"+O5/(1-O6)","v":198.71720116618076}]
[null,"COASEGURO:",null,null,{"$f":"+COTIZACION!D13","v":0.1},null,{"$f":"VLOOKUP(E8,FACTORES!$C$2:$D$6,2)","v":1}]
[null,"CATALOGO:"]
[null,"SUMA ASEGURADA PARTO O CESAREA",null,null,{"$f":"+COTIZACION!D17","v":15000}]
[null,"SEGURO DE ENFERMEDADES GRAVES",null,null,{"$f":"+COTIZACION!D19","v":10000},null,{"$f":"IF(E11=\"NO\",0,IF(SUM(COTIZACION!A27:A34)>=1,VLOOKUP(E11,FACTORES!$L$33:$M$55,2,0)*(1-DESC),0))","v":0}]
[null,"COBERTURA DE VISION",null,null,{"$f":"+COTIZACION!D18","v":"SI"},null,{"$f":"IF(E12=\"NO\",0,G23)","v":235.53}]
[null,null,null,null,null,"ZONA",null,null,null,null,"Comisión",0.26500000000000001,null,null,"Comisión",0.26500000000000001,null,null,"A"]
[null,"EMERGENCIA EXTRANJERO:",null,null,null,null,null,null,null,null,"G administración",0.1,null,null,"G administración",0.1,null,null,"S"]
[null,"COBER TOTAL EXTRANJERO:",null,null,null,null,null,null,null,null,"Utilidad",0.14845,null,null,"Utilidad",0.22600000000000001]
[null,"ZONA",null,null,null,null,{"$f":"+COTIZACION!D15","v":4},null,null,null,"B"]
[null,"FORMA DE PAGO:",null,null,{"$f":"+COTIZACION!C21","v":0},null,0,null,null,null,"C",null,493.82519999999994,"PaQ Adicional",{"$f":"+SUM(O18:O31)","v":288.108},{"$f":"+P13+P14+P15","v":0.59099999999999997},617.90039999999999]
[null,"PARTO",null,null,null,0.17,{"$f":"(433.18*(1-DESC))*1.14*0+K18*(1-DESC)","v":562.98},"*BUSCARV(G16,FACTORES!$F$30:$G$35,2,0)",null,null,{"$f":"ROUND(M18,2)","v":562.98},{"$f":"240.28*1.14","v":273.91919999999999},{"$f":"L18/(1-L13-L14-L15)","v":562.98263282293692},"Legrado",0,{"$f":"1-P17","v":0.40900000000000003},null,null,493.82519999999994,{"$f":"(M18/S18)-1","v":0.14004435744254651}]
[null,"DENTAL",null,null,null,0.14000000000000001,{"$f":"288*0+181.98*0+208.25*0+K19*(1-DESC)","v":237.4},null,null,null,{"$f":"ROUND(O3,2)","v":237.4},null,{"$f":"(M18/M17)-1","v":0.14004435744254651},"Donacion de organos",48.98,null,null,null,208.25,{"$f":"(K19/S19)-1","v":0.1399759903961586}]
[null,"PAQ_ADIC",null,null,null,0.17,{"$f":"(528.12*(1-DESC))*1.17*0+K20*(1-DESC)","v":704.42},null,null,null,{"$f":"ROUND(M21,2)","v":704.42},null,null,"Donacion de organos",0,null,null,null,617.90039999999999,0.14002191939024478]
{"$rows_left_out":93}
{"sheet":"CONYUGE","index":2,"n_rows":106,"n_cols":15,"rows_kept":106,"cut":false,"hidden":true,"merged":[[19,1,19,2],[149,18,149,19],[149,16,149,17],[134,15,134,18],[133,15,133,22],[17,12,17,13],[1,8,7,9],[18,5,18,6],[18,3,18,4],[17,9,17,10],[17,3,17,4],[17,5,17,6]]}
[null,null,"GASTOS MÉDICOS MAYORES INDIVIDUAL/FAMILIAR",null,null,null,null,null,"REGION COBERTURA BASICA"]
[null,null,null,null,null,null,null,null,{"$f":"IF(ISERROR(VLOOKUP(E3,VALORES!$A$6:$B$11,2,FALSE)),\"REGION NO VALIDA\",VLOOKUP(E3,VALORES!$A$6:$B$11,2,FALSE))","v":"CHIHUAHUA, NUEVO LEON, TAMAULIPAS"}]
[null,"REGIÓN:",null,null,{"$f":"+COTIZACION!D15","v":4},{"$f":"IF(E3>7,\"NO PROCEDE\",\" \")","v":" "},"FACTORES"]
[]
[null,"SUMA ASEGURADA:",null,null,{"$f":"+COTIZACION!D11","v":10000000},null,{"$f":"+TITULAR!G5","v":1.26}]
[null,"DEDUCIBLE:",null,null,{"$f":"+COTIZACION!D12","v":10000},null,{"$f":"+TITULAR!G6","v":0.88}]
[null,"COASEGURO:",null,null,{"$f":"+COTIZACION!D13","v":0.1},null,{"$f":"+TITULAR!G8","v":1}]
[null,"CATALOGO:"]
[null,"SUMA ASEGURADA PARTO O CESAREA"]
[null,null,null,null,null,"ZONA",null,null,null,null,null,null,null,null,"A"]
[null,"EMERGENCIA EXTRANJERO:",null,null,null,null,null,null,null,null,null,null,null,null,"S"]
[null,"COBER TOTAL EXTRANJERO:",null,null,null,null,null,null,null,null,"A"]
[null,null,null,null,null,null,null,null,null,null,"B"]
[null,"FORMA DE PAGO:",null,null,{"$f":"+COTIZACION!C21","v":0},null,{"$f":"+TITULAR!G17","v":0},null,null,null,"C"]
[]
[]
[]
[null,null,null,"PRIMA BASE ",null,"PRIMA TARIFA ",null,"R P FRAC",{"$f":"G14","v":0},"PRIMA TOTAL",null,null,"TARIFA CONYUGUE"]
[null,null,null,"REGIONALIZADA",null,"REGIONALIZADA",null,"DER POLIZA",0,"IVA",{"$f":"+COTIZACION!D20","v":0.16},null,"IVA",{"$f":"+COTIZACION!D20","v":0.16}]
[null,"EDAD",null,"HOMBRE","MUJER","HOMBRE","MUJER","HOMBRE","MUJER","HOMBRE","MUJER",null,"HOMBRE","MUJER"]
{"$rows_left_out":87}
{"sheet":"DEPENDIENTE","index":3,"n_rows":45,"n_cols":19,"rows_kept":45,"cut":false,"hidden":true,"merged":[[28,17,29,18],[1,8,7,9],[18,5,18,6],[145,22,145,23],[145,20,145,21],[68,19,68,26],[130,19,130,22],[73,19,73,26],[129,19,129,26],[19,1,19,2],[18,3,18,4],[17,9,17,10],[17,3,17,4],[17,5,17,6]]}
[null,null,"GASTOS MÉDICOS MAYORES INDIVIDUAL/FAMILIAR",null,null,null,null,null,"REGION COBERTURA BASICA"]
[null,null,null,null,null,null,null,null,{"$f":"IF(ISERROR(VLOOKUP(E3,VALORES!$A$6:$B$11,2,FALSE)),\"REGION NO VALIDA\",VLOOKUP(E3,VALORES!$A$6:$B$11,2,FALSE))","v":"CHIHUAHUA, NUEVO LEON, TAMAULIPAS"}]
[null,"REGIÓN:",null,null,{"$f":"+COTIZACION!D15","v":4},{"$f":"IF(E3>7,\"NO PROCEDE\",\" \")","v":" "},"FACTORES"]
[]
[null,"SUMA ASEGURADA:",null,null,{"$f":"+COTIZACION!D11","v":10000000},null,{"$f":"+TITULAR!G5","v":1.26}]
[null,"DEDUCIBLE:",null,null,{"$f":"+COTIZACION!D12","v":10000},null,{"$f":"+TITULAR!G6","v":0.88}]
[null,"COASEGURO:",null,null,{"$f":"+COTIZACION!D13","v":0.1},null,{"$f":"+TITULAR!G8","v":1}]
[null,"CATALOGO:"]
[null,null,null,null,null,"ZONA",null,null,null,null,null,null,null,null,null,null,null,null,"A"]
[null,"EMERGENCIA EXTRANJERO:",null,null,null,null,null,null,null,null,null,null,null,null,null,null,null,null,"S"]
[null,"COBER TOTAL EXTRANJERO:",null,null,null,null,null,null,null,null,"A"]
[null,null,null,null,null,null,null,null,null,null,"B"]
[null,"FORMA DE PAGO:",null,null,{"$f":"+COTIZACION!C21","v":0},null,{"$f":"+TITULAR!G17","v":0},null,null,null,"C"]
[]
[]
[]
[]
[null,null,null,"PRIMA BASE ",null,"PRIMA TARIFA ",null,"R P FRAC",{"$f":"G13","v":0},"PRIMA TOTAL"]
[null,null,null,"REGIONALIZADA",null,"REGIONALIZADA",null,"DER POLIZA",0,"IVA",{"$f":"+COTIZACION!D20","v":0.16}]
[null,"EDAD",null,"HOMBRE","MUJER","HOMBRE","MUJER","HOMBRE","MUJER","HOMBRE","MUJER"]
{"$rows_left_out":26}
{"sheet":"VALORES","index":4,"n_rows":38,"n_cols":8,"rows_kept":38,"cut":false,"hidden":true,"merged":[]}
["COTIZACIÓN"]
["R = RENOVACIÓN"]
["N = NUEVA"]
[]
["NO.","REGIÓN"]
[1,"CAMPECHE, CHIAPAS, GUERRERO, OAXACA, PUEBLA, QUINTANA ROO, TABASCO, TLAXCALA, VERACRUZ, YUCATAN"]
[2,"HIDALGO, NAYARIT"]
[3,"AGUASCALIENTES, COAHUILA, COLIMA, DURANGO, GUANAJUATO, JALISCO, MICHOACAN, ZACATECAS"]
[4,"CHIHUAHUA, NUEVO LEON, TAMAULIPAS"]
[5,"BAJA CALIFORNIA, BAJA CALIFORNIA SUR, MORELOS, QUERETARO, SAN LUIS POTOSI, SINALOA, SONORA"]
[6,"DISTRITO FEDERAL, EDO. DE MEXICO"]
[]
["SUMA ASEGURADA",null,"DEDUCIBLE",null,"COASEGURO",null,"FORMA DE PAGO","FORMA DE PAGO"]
[500000,null,4000,null,0,null,"A","ANUAL"]
[750000,null,4500,null,0.05,null,"S","SEMESTRAL"]
[1000000,null,5000,null,0.1]
[{"$f":"+A16+1000000","v":2000000},null,6000,null,0.15]
[{"$f":"+A17+1000000","v":3000000},null,7000,null,0.2]
[4000000,null,8000,null,0.25]
[5000000,null,9000,null,0.3]
{"$rows_left_out":19}
{"sheet":"CuadroEspecificacionesTARIFARIO","index":5,"n_rows":71,"n_cols":10,"rows_kept":71,"cut":false,"hidden":true,"merged":[[8,2,8,9],[13,1,13,9]]}
[]
[]
[]
[]
[]
[]
[]
[]
[]
[null,null,null,null,null,null,null,null,null,{"$f":"TODAY()","v":"2018-01-26"}]
[]
[null,null,null,null,null,null,null,null,"REGIÓN",{"$f":"TITULAR!E3","v":4}]
[]
[null,"CUADRO DE COBERTURAS"]
[null,"-","Tipo de Hospital",null,null,null,null,"Todos los hospitales"]
[]
[null,"-","Suma Asegurada",null,null,null,null,{"$f":"+TITULAR!E5","v":10000000},{"$f":"IF(H17<>\"SIN LÍMITE\",\"M.N.\",\"\")","v":"M.N."}]
[]
[null,"-","Deducible",null,null,"Enfermedad",null,{"$f":"+TITULAR!E6","v":10000},"M.N."]
[null,null,null,null,null,"Accidente",null,0,"M.N."]
{"$rows_left_out":52}
{"sheet":"COTIZACION","index":6,"n_rows":363,"n_cols":13,"rows_kept":363,"cut":false,"hidden":true,"merged":[[40,1,40,5],[36,8,38,9],[38,2,38,4],[1,1,1,2],[2,1,2,2],[31,8,31,9],[16,1,16,2],[6,1,6,3]]}
[]
[]
[]
[]
[]
[]
[null,"DATOS DE LA PÓLIZA"]
[null,"Tipo de Póliza",null,"RENOVADA",{"$f":"+IF(AND(D8=\"NUEVA\",D9=\"ANTES DEL 01/10/2016\"),\"NO ES VÁLIDA, RECONSIDERAR SU PRIMERA EMISIÓN\",CONCATENATE(\"APLICA PARA AQUELLA PÓLIZA \",D8,\" CON PRIMER VIGENCIA EMITIDA \",D9))","v":"APLICA PARA AQUELLA PÓLIZA RENOVADA CON PRIMER VIGENCIA EMITIDA ANTES DEL 01/10/2016"}]
[null,"Primera vigencia emitida en Seguros Banorte",null,"ANTES DEL 01/10/2016",{"$f":"+IF(IFERROR(FACTORES!A37,\"VALIDAR INICIO DE VIGENCIA\")=0,\"\",\"VALIDAR INICIO DE VIGENCIA\")","v":"VALIDAR INICIO DE VIGENCIA"}]
[null,"TIPO DE COTIZACIÓN",null,"INDIVIDUAL"]
[null,"Suma Asegurada",null,10000000]
[null,"Deducible",null,10000,{"$f":"+IF(D8=\"NUEVA \",IF(D12<10000,\"Deducible no permitido para pólizas nuevas\",\"\"),\"\")","v":""}]
[null,{"$f":"+CONCATENATE(\"Coaseguro con tope a \",VLOOKUP(D13,FACTORES!C16:D20,2,FALSE))","v":"Coaseguro con tope a $30,000"},null,0.1]
[null,"Estado",null,"NUEVO LEÓN"]
[null,"Región",null,{"$f":"+VLOOKUP(D14,C310:D341,2,0)","v":4}]
[null,"Eliminación de deducible por accidente",null,"SI"]
[null,"Suma Asegurada Parto o Cesárea",null,15000]
[null,"Cobertura de Visión Incremental",null,"SI"]
[null,"Cobertura de Indemnización por Enfermedad Grave",null,10000,{"$f":"IF(AND(D19<>\"NO\",SUM(A27:A34)<1),\"NO CUMPLE CON LOS LIMITES DE EDAD\",\"\")","v":"NO CUMPLE CON LOS LIMITES DE EDAD"}]
[null,"IVA",null,0.16]
{"$rows_left_out":344}
{"sheet":"IMPRESION","index":7,"n_rows":224,"n_cols":11,"rows_kept":224,"cut":false,"hidden":true,"merged":[[84,4,84,5],[86,2,86,3],[99,1,100,11],[6,1,7,10],[8,1,9,10],[94,2,94,10],[97,2,98,10],[89,2,89,3],[88,2,88,3],[11,1,11,10],[70,2,71,6],[70,7,71,7],[70,8,71,8],[86,4,86,6],[70,9,71,9],[57,2,57,10],[69,2,69,10],[84,2,84,3]]}
[]
[]
[]
[]
[]
[null,null,null,null,null,null,null,null,null,null,{"$f":"TODAY()","v":"2018-01-26"}]
[null,{"$f":"+\"Apreciable  \"&COTIZACION!C27","v":"Apreciable  "}]
[]
[null,{"$f":"+\"Agradecemos de antemano su preferencia y esperamos que la presente propuesta de Gastos Médicos \"&COTIZACION!D10&\" cumpla sus expectativas.\"","v":"Agradecemos de antemano su preferencia y esperamos que la presente propuesta de Gastos Médicos INDIVIDUAL cumpla sus expectativas."}]
[]
[]
[null,"CUADRO DE COBERTURAS"]
[null,"-","Tipo de Hospital",null,null,null,null,null,"Hospitales del Plan"]
[]
[null,"-","Suma Asegurada",null,null,null,null,null,{"$f":"+COTIZACION!D11","v":10000000},{"$f":"IF(I15<>\"SIN LÍMITE\",\"M.N.\",\"\")","v":"M.N."}]
[]
[null,"-","Deducible por Accidente y Enfermedad",null,null,null,null,null,{"$f":"+TITULAR!E6","v":10000},"M.N."]
[]
[null,"-","Coaseguro",null,null,null,"Enfermedad",null,{"$f":"+CONCATENATE(TITULAR!E8*100,\"% con tope de \",VLOOKUP(COTIZACION!D13,FACTORES!C16:D20,2,FALSE)&\" M.N.\")","v":"10% con tope de $30,000 M.N."}]
[null,null,null,null,null,null,"Accidente",null,0]
{"$rows_left_out":205}
{"sheet":"TARIFARIO","index":8,"n_rows":98,"n_cols":12,"rows_kept":98,"cut":false,"hidden":true,"merged":[[6,9,6,10],[6,1,6,2],[95,1,95,11],[70,1,70,3],[12,1,13,3],[12,5,13,7],[12,9,13,11],[76,1,77,3]]}
[]
[]
[]
[]
[]
[]
[null,"Tipo de póliza",null,{"$f":"+COTIZACION!D8","v":"RENOVADA"},null,null,null,null,null,"Región de tarifa",null,{"$f":"+COTIZACION!D15","v":4}]
[]
[null,"SUMA ASEGURADA:",null,{"$f":"TITULAR!E5","v":10000000},null,"SUMA ASEGURADA:",null,{"$f":"CONYUGE!E5","v":10000000},null,"SUMA ASEGURADA:",null,{"$f":"DEPENDIENTE!E5","v":10000000}]
[null,"DEDUCIBLE:",null,{"$f":"TITULAR!E6","v":10000},null,"DEDUCIBLE:",null,{"$f":"CONYUGE!E6","v":10000},null,"DEDUCIBLE:",null,{"$f":"DEPENDIENTE!E6","v":10000}]
[null,"COASEGURO:",null,{"$f":"TITULAR!E8","v":0.1},null,"COASEGURO:",null,{"$f":"CONYUGE!E7","v":0.1},null,"COASEGURO:",null,{"$f":"DEPENDIENTE!E7","v":0.1}]
[]
[null,"Prima Total Titular",null,null,null,"Prima Total Cónyuge",null,null,null,"Prima Total Dependiente"]
[]
[null,"EDAD","HOMBRE","MUJER",null,"EDAD","HOMBRE","MUJER",null,"EDAD","HOMBRE","MUJER"]
[null,"18",{"$f":"IFERROR(TITULAR!J45,0)","v":9192.9563426981913},{"$f":"IFERROR(TITULAR!K45,0)","v":9199.3363426981923},null,"18",{"$f":"IFERROR(+CONYUGE!J39,0)","v":7499.2375999999995},{"$f":"IFERROR(+CONYUGE!K39,0)","v":7505.6175999999987},null,"0 - 5",{"$f":"IFERROR(DEPENDIENTE!J26,0)","v":7538.7587999999987},{"$f":"IFERROR(DEPENDIENTE!K26,0)","v":7563.652399999999}]
[null,{"$f":"+B16+1","v":19},{"$f":"IFERROR(TITULAR!J46,0)","v":9389.3907426981914},{"$f":"IFERROR(TITULAR!K46,0)","v":9276.4763426981917},null,{"$f":"+F16+1","v":19},{"$f":"IFERROR(+CONYUGE!J40,0)","v":7695.6719999999996},{"$f":"IFERROR(+CONYUGE!K40,0)","v":7582.757599999999},null,6,{"$f":"IFERROR(DEPENDIENTE!J27,0)","v":7538.7587999999987},{"$f":"IFERROR(DEPENDIENTE!K27,0)","v":7563.652399999999}]
[null,{"$f":"+B17+1","v":20},{"$f":"IFERROR(TITULAR!J47,0)","v":9611.3335426981903},{"$f":"IFERROR(TITULAR!K47,0)","v":10258.752742698192},null,{"$f":"+F17+1","v":20},{"$f":"IFERROR(+CONYUGE!J41,0)","v":7917.6147999999994},{"$f":"IFERROR(+CONYUGE!K41,0)","v":8565.0339999999997},null,{"$f":"+J17+1","v":7},{"$f":"IFERROR(DEPENDIENTE!J28,0)","v":7538.7587999999987},{"$f":"IFERROR(DEPENDIENTE!K28,0)","v":7563.652399999999}]
[null,21,{"$f":"IFERROR(TITULAR!J48,0)","v":10118.172342698192},{"$f":"IFERROR(TITULAR!K48,0)","v":12099.951142698192},null,21,{"$f":"IFERROR(+CONYUGE!J42,0)","v":8424.4535999999989},{"$f":"IFERROR(+CONYUGE!K42,0)","v":10406.232400000001},null,{"$f":"+J18+1","v":8},{"$f":"IFERROR(DEPENDIENTE!J29,0)","v":7538.7587999999987},{"$f":"IFERROR(DEPENDIENTE!K29,0)","v":7563.652399999999}]
[null,22,{"$f":"IFERROR(TITULAR!J49,0)","v":10416.338742698192},{"$f":"IFERROR(TITULAR!K49,0)","v":12488.817942698191},null,22,{"$f":"IFERROR(+CONYUGE!J43,0)","v":8722.619999999999},{"$f":"IFERROR(+CONYUGE!K43,0)","v":10795.099199999999},null,9,{"$f":"IFERROR(DEPENDIENTE!J30,0)","v":7538.7587999999987},{"$f":"IFERROR(DEPENDIENTE!K30,0)","v":7563.652399999999}]
{"$rows_left_out":79}
{"sheet":"Instrucciones","index":9,"n_rows":29,"n_cols":9,"rows_kept":29,"cut":false,"hidden":true,"merged":[[36,1,36,8],[37,1,37,8],[38,1,38,8],[20,1,20,8],[9,1,9,8],[11,1,11,8],[12,1,12,8],[13,1,13,8],[16,1,16,8],[18,1,18,8],[17,1,17,8],[19,1,19,8],[39,1,39,8],[40,1,40,8],[27,1,27,8],[21,1,21,8],[23,1,23,8],[25,1,25,8],[24,1,24,8],[26,1,26,8],[29,1,29,8],[22,1,22,8],[28,1,28,8],[30,1,30,8],[31,1,31,8],[32,1,32,8],[33,1,33,8],[34,1,34,8]]}
[]
[]
[]
[]
[]
[]
[null,null,null,null,null,null,null,null,{"$f":"TODAY()","v":"2018-01-26"}]
[]
[]
[null,"INSTRUCCIONES"]
[]
[null,"Seguros Banorte elaboró para ti esta herramienta de sencilla utilización de la que . . . "]
[null," ¡Estamos seguros, te será de gran utilidad!"]
[]
[]
[]
[null,"1. Seleccione el TIPO DE COTIZACIÓN (Individual o Familiar)"]
[null,"2. Seleccione la fecha de PRIMER VIGENCIA en Seguros Banorte de la póliza a cotizar"]
[null,"3. Seleccione la SUMA ASEGURADA deseada"]
[null,"4. Seleccione el DEDUCIBLE deseado"]
{"$rows_left_out":10}
{"sheet":"Cotizador","index":10,"n_rows":0,"n_cols":0,"rows_kept":0,"cut":false,"hidden":false,"merged":[]}

{"sheet":"CAMBIOS ME","index":11,"n_rows":52,"n_cols":8,"rows_kept":52,"cut":false,"hidden":true,"merged":[]}
["CAMBIOS MEDICO ESENCIAL"]
[]
["HOJA FACTORES (TABLAS DE CALCULO)"]
["Tabla de Deducible"]
["Tabla de Enfermedades Graves"]
["Tabla de Tarifas"]
["Se modifica tabla de factores por región a quedar 4"]
[]
["HOJA TITULAR DEL COTIZADOR (CALCULO TARIFA)"]
["Modificación de costos cobertura Adicionales (dental, PAQ_ADIC, ASIST_IKE, Cvisión)"]
["Se elimina la cobertura de Educasystem (maestro a domicilio)"]
["Se agrega costo por cobertura de parto y cesárea (mujeres edades de 18 a 54 años ya sean titulares, cónyuge o dependientes)"]
["Modificación de costo de Derecho de Póliza a 700 pesos"]
[]
["HOJA COTIZACION (COTIZADOR)"]
["se deja deducible mínimo en 6,000"]
["se modifica Querétaro a zona 4"]
["se modifican la tabla de estados por zona (sólo hay 4 zonas)"]
[]
["HOJA IMPRESIÓN (formato Cotización y Cuadro de especificaciones)",null,null,null,null,null,null,"CUADRO DE ESPECIFICACIONES IMPLICA"]
{"$rows_left_out":32}